{"text_format":"1","workbook":"xlsx","n_sheets":8,"sheets":["Macros","Regulation 28 calculator (%)","Limits","Regulation 28 calculator (rand)","Allocation","Allocation (rand)","Unit trust asset class limits","Fund list"],"not_rendered":{"charts":0,"images":2,"macros":1,"external_links":0,"defined_names":14,"comments":0,"pivot_tables":0},"unopened":[],"bounds":{"document_bytes":16777216,"sheet_cells":100000,"rows_first":2000,"rows_last":500,"rows_between":2000,"halvings":0,"cell_chars":16384,"cell_head_chars":4096},"cells_cut":0,"cells_raw":0,"read":"whole","date_system":"1900"}

{"sheet":"Macros","index":0,"n_rows":13,"n_cols":3,"rows_kept":13,"cut":false,"hidden":true,"merged":[[5,11,6,11],[10,6,12,11],[14,6,19,10],[14,11,19,11],[22,2,22,4],[5,6,6,6],[5,7,6,7],[5,8,6,8],[5,9,6,9],[5,10,6,10],[37,2,44,4],[46,2,47,4],[1,2,1,5],[27,2,27,3],[28,2,28,4],[29,2,29,4],[30,2,30,4],[31,2,31,4],[33,2,34,4],[24,2,24,4]]}
[]
[null,null,"Please enable macros"]
[]
[null,null,"1.  Excel 2007:  Click the Microsoft Office Button            , and then click Excel Options."]
[null,null,"1.  Excel 2010:  Click the File tab, and then click Options."]
[]
[null,null,"2. In the Trust Centre category, click Trust Centre Settings, and then click the Macro Settings category."]
[]
{"$rows_left_out":6}
{"sheet":"Regulation 28 calculator (%)","index":1,"n_rows":47,"n_cols":12,"rows_kept":47,"cut":false,"hidden":false,"merged":[[24,2,24,4],[27,2,27,3],[37,2,44,4],[46,2,47,4],[33,2,34,4],[28,2,28,4],[30,2,30,4],[31,2,31,4],[29,2,29,4],[14,11,19,11],[3,3,3,4],[5,11,6,11],[22,2,22,4],[5,6,6,6],[5,7,6,7],[5,8,6,8],[5,9,6,9],[5,10,6,10],[10,6,12,11],[14,6,19,10]]}
[]
[null,null,"Regulation 28 investment compliance calculator "]
[]
[null,null,"Total amount"]
[]
[null,null,"Unit trust name","Amount","%",null,"Exposure","Regulation 28 limit","Investment exposure","Regulation 28 compliant","% over limit","Rand amount over limit"]
[null,null,null,{"$f":"IF(AND(E7>0,C7<>\"\",ISNUMBER(Total),ISNUMBER(E7)),E7*Total,\"\")","v":""}]
[null,null,null,"",null,null,"Equity",0.75,{"$f":"IF(AND(AreaPercent=1,Total=AreaTotal,Total<>\"\",Total>0),ROUND(HLOOKUP(G8,Allocation!$B$1:$D$17,MATCH(\"Total\",Allocation!A:A,0),FALSE),4),\"\")","v":""},{"$f":"IF(AND(AreaPercent=1,Total=AreaTotal,Total<>\"\",Total>0),IF(I8-H8>0.00004999,\"No\",\"Yes\"),\"\")","v":""},{"$f":"IF(AND(AreaPercent=1,Total=AreaTotal,Total<>\"\",Total>0),IF(I8-H8>0.00004999,I8-H8,\"\"),\"\")","v":""},{"$f":"IF(AND(AreaPercent=1,Total=AreaTotal,Total<>\"\",Total>0),IF(I8-H8>0.00004999,K8*Total,\"\"),\"\")","v":""}]
{"$rows_left_out":40}
{"sheet":"Limits","index":2,"n_rows":4,"n_cols":6,"rows_kept":4,"cut":false,"hidden":true,"merged":[]}
["Code","ReportingDescription","Limit",null,"Last update notice","2015-06-17"]
["equity","Equity",0.75]
["offshore","Offshore",0.25]
["prop","Property",0.25]

{"sheet":"Regulation 28 calculator (rand)","index":3,"n_rows":47,"n_cols":12,"rows_kept":47,"cut":false,"hidden":false,"merged":[[3,3,3,4],[5,6,6,6],[5,11,6,11],[10,6,12,11],[14,6,19,10],[14,11,19,11],[5,9,6,9],[5,10,6,10],[5,8,6,8],[31,2,31,4],[33,2,34,4],[46,2,47,4],[37,2,44,4],[5,7,6,7],[29,2,29,4],[30,2,30,4],[28,2,28,4],[24,2,24,4],[27,2,27,3],[22,2,22,4]]}
[]
[null,null,"Regulation 28 investment compliance calculator ",null,null,null,null,null,null,null,null,{"$f":"'Regulation 28 calculator (%)'!L2","v":0}]
[]
[null,null,"Total amount"]
[]
[null,null,"Unit trust name","Amount","%",null,"Exposure","Regulation 28 limit","Investment exposure","Regulation 28 compliant","% over limit","Rand amount over limit"]
[null,null,null,null,{"$f":"IF(AND(D7>0,C7<>\"\",ISNUMBER(Total),ISNUMBER(D7)),D7/Total,\"\")","v":""}]
[null,null,null,null,{"$f":"IF(AND(D8>0,C8<>\"\",ISNUMBER(Total),ISNUMBER(D8)),D8/Total,\"\")","v":""},null,"Equity",0.75,{"$f":"IF(AND(AreaPercent=1,Total=AreaTotal,Total<>\"\",Total>0),ROUND(HLOOKUP(G8,'Allocation (rand)'!$B$1:$D$17,MATCH(\"Total\",'Allocation (rand)'!A:A,0),FALSE),4),\"\")","v":""},{"$f":"IF(AND(AreaPercent=1,Total=AreaTotal,Total<>\"\",Total>0),IF(I8-H8>0.00004999,\"No\",\"Yes\"),\"\")","v":""},{"$f":"IF(AND(AreaPercent=1,Total=AreaTotal,Total<>\"\",Total>0),IF(I8-H8>0.00004999,I8-H8,\"\"),\"\")","v":""},{"$f":"IF(AND(AreaPercent=1,Total=AreaTotal,Total<>\"\",Total>0),IF(I8-H8>0.00004999,K8*Total,\"\"),\"\")","v":""}]
{"$rows_left_out":40}
{"sheet":"Allocation","index":4,"n_rows":17,"n_cols":4,"rows_kept":17,"cut":false,"hidden":true,"merged":[]}
["Display name","Equity","Foreign","Property"]
["fund","equity","offshore","prop"]
[{"$f":"IF('Regulation 28 calculator (%)'!C7>\"\",'Regulation 28 calculator (%)'!C7,\"\")","v":""},{"$f":"IF(ISERROR(VLOOKUP($A3,'Fund list'!A:J,MATCH(Allocation!B$1,'Fund list'!A$5:J$5,0),FALSE)*VLOOKUP($A3,'Regulation 28 calculator (%)'!$C7:$E$20,3,FALSE)),\"\",VLOOKUP($A3,'Fund list'!A:J,MATCH(Allocation!B$1,'Fund list'!A$5:J$5,0),FALSE)*VLOOKUP($A3,'Regulation 28 calculator (%)'!$C7:$E$20,3,FALSE))","v":""},{"$f":"IF(ISERROR(VLOOKUP($A3,'Fund list'!A:J,MATCH(Allocation!C$1,'Fund list'!A$5:J$5,0),FALSE)*VLOOKUP($A3,'Regulation 28 calculator (%)'!$C7:$E$20,3,FALSE)),\"\",VLOOKUP($A3,'Fund list'!A:J,MATCH(Allocation!C$1,'Fund list'!A$5:J$5,0),FALSE)*VLOOKUP($A3,'Regulation 28 calculator (%)'!$C7:$E$20,3,FALSE))","v":""},{"$f":"IF(ISERROR(VLOOKUP($A3,'Fund list'!A:J,MATCH(Allocation!D$1,'Fund list'!A$5:J$5,0),FALSE)*VLOOKUP($A3,'Regulation 28 calculator (%)'!$C7:$E$20,3,FALSE)),\"\",VLOOKUP($A3,'Fund list'!A:J,MATCH(Allocation!D$1,'Fund list'!A$5:J$5,0),FALSE)*VLOOKUP($A3,'Regulation 28 calculator (%)'!$C7:$E$20,3,FALSE))","v":""}]
[{"$f":"IF('Regulation 28 calculator (%)'!C8>\"\",'Regulation 28 calculator (%)'!C8,\"\")","v":""},{"$f":"IF(ISERROR(VLOOKUP($A4,'Fund list'!A:J,MATCH(Allocation!B$1,'Fund list'!A$5:J$5,0),FALSE)*VLOOKUP($A4,'Regulation 28 calculator (%)'!$C8:$E$20,3,FALSE)),\"\",VLOOKUP($A4,'Fund list'!A:J,MATCH(Allocation!B$1,'Fund list'!A$5:J$5,0),FALSE)*VLOOKUP($A4,'Regulation 28 calculator (%)'!$C8:$E$20,3,FALSE))","v":""},{"$f":"IF(ISERROR(VLOOKUP($A4,'Fund list'!A:J,MATCH(Allocation!C$1,'Fund list'!A$5:J$5,0),FALSE)*VLOOKUP($A4,'Regulation 28 calculator (%)'!$C8:$E$20,3,FALSE)),\"\",VLOOKUP($A4,'Fund list'!A:J,MATCH(Allocation!C$1,'Fund list'!A$5:J$5,0),FALSE)*VLOOKUP($A4,'Regulation 28 calculator (%)'!$C8:$E$20,3,FALSE))","v":""},{"$f":"IF(ISERROR(VLOOKUP($A4,'Fund list'!A:J,MATCH(Allocation!D$1,'Fund list'!A$5:J$5,0),FALSE)*VLOOKUP($A4,'Regulation 28 calculator (%)'!$C8:$E$20,3,FALSE)),\"\",VLOOKUP($A4,'Fund list'!A:J,MATCH(Allocation!D$1,'Fund list'!A$5:J$5,0),FALSE)*VLOOKUP($A4,'Regulation 28 calculator (%)'!$C8:$E$20,3,FALSE))","v":""}]
[{"$f":"IF('Regulation 28 calculator (%)'!C9>\"\",'Regulation 28 calculator (%)'!C9,\"\")","v":""},{"$f":"IF(ISERROR(VLOOKUP($A5,'Fund list'!A:J,MATCH(Allocation!B$1,'Fund list'!A$5:J$5,0),FALSE)*VLOOKUP($A5,'Regulation 28 calculator (%)'!$C9:$E$20,3,FALSE)),\"\",VLOOKUP($A5,'Fund list'!A:J,MATCH(Allocation!B$1,'Fund list'!A$5:J$5,0),FALSE)*VLOOKUP($A5,'Regulation 28 calculator (%)'!$C9:$E$20,3,FALSE))","v":""},{"$f":"IF(ISERROR(VLOOKUP($A5,'Fund list'!A:J,MATCH(Allocation!C$1,'Fund list'!A$5:J$5,0),FALSE)*VLOOKUP($A5,'Regulation 28 calculator (%)'!$C9:$E$20,3,FALSE)),\"\",VLOOKUP($A5,'Fund list'!A:J,MATCH(Allocation!C$1,'Fund list'!A$5:J$5,0),FALSE)*VLOOKUP($A5,'Regulation 28 calculator (%)'!$C9:$E$20,3,FALSE))","v":""},{"$f":"IF(ISERROR(VLOOKUP($A5,'Fund list'!A:J,MATCH(Allocation!D$1,'Fund list'!A$5:J$5,0),FALSE)*VLOOKUP($A5,'Regulation 28 calculator (%)'!$C9:$E$20,3,FALSE)),\"\",VLOOKUP($A5,'Fund list'!A:J,MATCH(Allocation!D$1,'Fund list'!A$5:J$5,0),FALSE)*VLOOKUP($A5,'Regulation 28 calculator (%)'!$C9:$E$20,3,FALSE))","v":""}]
[{"$f":"IF('Regulation 28 calculator (%)'!C10>\"\",'Regulation 28 calculator (%)'!C10,\"\")","v":""},{"$f":"IF(ISERROR(VLOOKUP($A6,'Fund list'!A:J,MATCH(Allocation!B$1,'Fund list'!A$5:J$5,0),FALSE)*VLOOKUP($A6,'Regulation 28 calculator (%)'!$C10:$E$20,3,FALSE)),\"\",VLOOKUP($A6,'Fund list'!A:J,MATCH(Allocation!B$1,'Fund list'!A$5:J$5,0),FALSE)*VLOOKUP($A6,'Regulation 28 calculator (%)'!$C10:$E$20,3,FALSE))","v":""},{"$f":"IF(ISERROR(VLOOKUP($A6,'Fund list'!A:J,MATCH(Allocation!C$1,'Fund list'!A$5:J$5,0),FALSE)*VLOOKUP($A6,'Regulation 28 calculator (%)'!$C10:$E$20,3,FALSE)),\"\",VLOOKUP($A6,'Fund list'!A:J,MATCH(Allocation!C$1,'Fund list'!A$5:J$5,0),FALSE)*VLOOKUP($A6,'Regulation 28 calculator (%)'!$C10:$E$20,3,FALSE))","v":""},{"$f":"IF(ISERROR(VLOOKUP($A6,'Fund list'!A:J,MATCH(Allocation!D$1,'Fund list'!A$5:J$5,0),FALSE)*VLOOKUP($A6,'Regulation 28 calculator (%)'!$C10:$E$20,3,FALSE)),\"\",VLOOKUP($A6,'Fund list'!A:J,MATCH(Allocation!D$1,'Fund list'!A$5:J$5,0),FALSE)*VLOOKUP($A6,'Regulation 28 calculator (%)'!$C10:$E$20,3,FALSE))","v":""}]
[{"$f":"IF('Regulation 28 calculator (%)'!C11>\"\",'Regulation 28 calculator (%)'!C11,\"\")","v":""},{"$f":"IF(ISERROR(VLOOKUP($A7,'Fund list'!A:J,MATCH(Allocation!B$1,'Fund list'!A$5:J$5,0),FALSE)*VLOOKUP($A7,'Regulation 28 calculator (%)'!$C11:$E$20,3,FALSE)),\"\",VLOOKUP($A7,'Fund list'!A:J,MATCH(Allocation!B$1,'Fund list'!A$5:J$5,0),FALSE)*VLOOKUP($A7,'Regulation 28 calculator (%)'!$C11:$E$20,3,FALSE))","v":""},{"$f":"IF(ISERROR(VLOOKUP($A7,'Fund list'!A:J,MATCH(Allocation!C$1,'Fund list'!A$5:J$5,0),FALSE)*VLOOKUP($A7,'Regulation 28 calculator (%)'!$C11:$E$20,3,FALSE)),\"\",VLOOKUP($A7,'Fund list'!A:J,MATCH(Allocation!C$1,'Fund list'!A$5:J$5,0),FALSE)*VLOOKUP($A7,'Regulation 28 calculator (%)'!$C11:$E$20,3,FALSE))","v":""},{"$f":"IF(ISERROR(VLOOKUP($A7,'Fund list'!A:J,MATCH(Allocation!D$1,'Fund list'!A$5:J$5,0),FALSE)*VLOOKUP($A7,'Regulation 28 calculator (%)'!$C11:$E$20,3,FALSE)),\"\",VLOOKUP($A7,'Fund list'!A:J,MATCH(Allocation!D$1,'Fund list'!A$5:J$5,0),FALSE)*VLOOKUP($A7,'Regulation 28 calculator (%)'!$C11:$E$20,3,FALSE))","v":""}]
[{"$f":"IF('Regulation 28 calculator (%)'!C12>\"\",'Regulation 28 calculator (%)'!C12,\"\")","v":""},{"$f":"IF(ISERROR(VLOOKUP($A8,'Fund list'!A:J,MATCH(Allocation!B$1,'Fund list'!A$5:J$5,0),FALSE)*VLOOKUP($A8,'Regulation 28 calculator (%)'!$C12:$E$20,3,FALSE)),\"\",VLOOKUP($A8,'Fund list'!A:J,MATCH(Allocation!B$1,'Fund list'!A$5:J$5,0),FALSE)*VLOOKUP($A8,'Regulation 28 calculator (%)'!$C12:$E$20,3,FALSE))","v":""},{"$f":"IF(ISERROR(VLOOKUP($A8,'Fund list'!A:J,MATCH(Allocation!C$1,'Fund list'!A$5:J$5,0),FALSE)*VLOOKUP($A8,'Regulation 28 calculator (%)'!$C12:$E$20,3,FALSE)),\"\",VLOOKUP($A8,'Fund list'!A:J,MATCH(Allocation!C$1,'Fund list'!A$5:J$5,0),FALSE)*VLOOKUP($A8,'Regulation 28 calculator (%)'!$C12:$E$20,3,FALSE))","v":""},{"$f":"IF(ISERROR(VLOOKUP($A8,'Fund list'!A:J,MATCH(Allocation!D$1,'Fund list'!A$5:J$5,0),FALSE)*VLOOKUP($A8,'Regulation 28 calculator (%)'!$C12:$E$20,3,FALSE)),\"\",VLOOKUP($A8,'Fund list'!A:J,MATCH(Allocation!D$1,'Fund list'!A$5:J$5,0),FALSE)*VLOOKUP($A8,'Regulation 28 calculator (%)'!$C12:$E$20,3,FALSE))","v":""}]
{"$rows_left_out":10}
{"sheet":"Allocation (rand)","index":5,"n_rows":17,"n_cols":4,"rows_kept":17,"cut":false,"hidden":true,"merged":[]}
["Display name","Equity","Foreign","Property"]
["fund","equity","offshore","prop"]
[{"$f":"IF('Regulation 28 calculator (rand)'!C7>\"\",'Regulation 28 calculator (rand)'!C7,\"\")","v":""},{"$f":"IF(ISERROR(VLOOKUP($A3,'Fund list'!A:J,MATCH('Allocation (rand)'!B$1,'Fund list'!A$5:J$5,0),FALSE)*VLOOKUP($A3,'Regulation 28 calculator (rand)'!$C7:$E$20,3,FALSE)),\"\",VLOOKUP($A3,'Fund list'!A:J,MATCH('Allocation (rand)'!B$1,'Fund list'!A$5:J$5,0),FALSE)*VLOOKUP($A3,'Regulation 28 calculator (rand)'!$C7:$E$20,3,FALSE))","v":""},{"$f":"IF(ISERROR(VLOOKUP($A3,'Fund list'!A:J,MATCH('Allocation (rand)'!C$1,'Fund list'!A$5:J$5,0),FALSE)*VLOOKUP($A3,'Regulation 28 calculator (rand)'!$C7:$E$20,3,FALSE)),\"\",VLOOKUP($A3,'Fund list'!A:J,MATCH('Allocation (rand)'!C$1,'Fund list'!A$5:J$5,0),FALSE)*VLOOKUP($A3,'Regulation 28 calculator (rand)'!$C7:$E$20,3,FALSE))","v":""},{"$f":"IF(ISERROR(VLOOKUP($A3,'Fund list'!A:J,MATCH('Allocation (rand)'!D$1,'Fund list'!A$5:J$5,0),FALSE)*VLOOKUP($A3,'Regulation 28 calculator (rand)'!$C7:$E$20,3,FALSE)),\"\",VLOOKUP($A3,'Fund list'!A:J,MATCH('Allocation (rand)'!D$1,'Fund list'!A$5:J$5,0),FALSE)*VLOOKUP($A3,'Regulation 28 calculator (rand)'!$C7:$E$20,3,FALSE))","v":""}]
[{"$f":"IF('Regulation 28 calculator (rand)'!C8>\"\",'Regulation 28 calculator (rand)'!C8,\"\")","v":""},{"$f":"IF(ISERROR(VLOOKUP($A4,'Fund list'!A:J,MATCH('Allocation (rand)'!B$1,'Fund list'!A$5:J$5,0),FALSE)*VLOOKUP($A4,'Regulation 28 calculator (rand)'!$C8:$E$20,3,FALSE)),\"\",VLOOKUP($A4,'Fund list'!A:J,MATCH('Allocation (rand)'!B$1,'Fund list'!A$5:J$5,0),FALSE)*VLOOKUP($A4,'Regulation 28 calculator (rand)'!$C8:$E$20,3,FALSE))","v":""},{"$f":"IF(ISERROR(VLOOKUP($A4,'Fund list'!A:J,MATCH('Allocation (rand)'!C$1,'Fund list'!A$5:J$5,0),FALSE)*VLOOKUP($A4,'Regulation 28 calculator (rand)'!$C8:$E$20,3,FALSE)),\"\",VLOOKUP($A4,'Fund list'!A:J,MATCH('Allocation (rand)'!C$1,'Fund list'!A$5:J$5,0),FALSE)*VLOOKUP($A4,'Regulation 28 calculator (rand)'!$C8:$E$20,3,FALSE))","v":""},{"$f":"IF(ISERROR(VLOOKUP($A4,'Fund list'!A:J,MATCH('Allocation (rand)'!D$1,'Fund list'!A$5:J$5,0),FALSE)*VLOOKUP($A4,'Regulation 28 calculator (rand)'!$C8:$E$20,3,FALSE)),\"\",VLOOKUP($A4,'Fund list'!A:J,MATCH('Allocation (rand)'!D$1,'Fund list'!A$5:J$5,0),FALSE)*VLOOKUP($A4,'Regulation 28 calculator (rand)'!$C8:$E$20,3,FALSE))","v":""}]
[{"$f":"IF('Regulation 28 calculator (rand)'!C9>\"\",'Regulation 28 calculator (rand)'!C9,\"\")","v":""},{"$f":"IF(ISERROR(VLOOKUP($A5,'Fund list'!A:J,MATCH('Allocation (rand)'!B$1,'Fund list'!A$5:J$5,0),FALSE)*VLOOKUP($A5,'Regulation 28 calculator (rand)'!$C9:$E$20,3,FALSE)),\"\",VLOOKUP($A5,'Fund list'!A:J,MATCH('Allocation (rand)'!B$1,'Fund list'!A$5:J$5,0),FALSE)*VLOOKUP($A5,'Regulation 28 calculator (rand)'!$C9:$E$20,3,FALSE))","v":""},{"$f":"IF(ISERROR(VLOOKUP($A5,'Fund list'!A:J,MATCH('Allocation (rand)'!C$1,'Fund list'!A$5:J$5,0),FALSE)*VLOOKUP($A5,'Regulation 28 calculator (rand)'!$C9:$E$20,3,FALSE)),\"\",VLOOKUP($A5,'Fund list'!A:J,MATCH('Allocation (rand)'!C$1,'Fund list'!A$5:J$5,0),FALSE)*VLOOKUP($A5,'Regulation 28 calculator (rand)'!$C9:$E$20,3,FALSE))","v":""},{"$f":"IF(ISERROR(VLOOKUP($A5,'Fund list'!A:J,MATCH('Allocation (rand)'!D$1,'Fund list'!A$5:J$5,0),FALSE)*VLOOKUP($A5,'Regulation 28 calculator (rand)'!$C9:$E$20,3,FALSE)),\"\",VLOOKUP($A5,'Fund list'!A:J,MATCH('Allocation (rand)'!D$1,'Fund list'!A$5:J$5,0),FALSE)*VLOOKUP($A5,'Regulation 28 calculator (rand)'!$C9:$E$20,3,FALSE))","v":""}]
[{"$f":"IF('Regulation 28 calculator (rand)'!C10>\"\",'Regulation 28 calculator (rand)'!C10,\"\")","v":""},{"$f":"IF(ISERROR(VLOOKUP($A6,'Fund list'!A:J,MATCH('Allocation (rand)'!B$1,'Fund list'!A$5:J$5,0),FALSE)*VLOOKUP($A6,'Regulation 28 calculator (rand)'!$C10:$E$20,3,FALSE)),\"\",VLOOKUP($A6,'Fund list'!A:J,MATCH('Allocation (rand)'!B$1,'Fund list'!A$5:J$5,0),FALSE)*VLOOKUP($A6,'Regulation 28 calculator (rand)'!$C10:$E$20,3,FALSE))","v":""},{"$f":"IF(ISERROR(VLOOKUP($A6,'Fund list'!A:J,MATCH('Allocation (rand)'!C$1,'Fund list'!A$5:J$5,0),FALSE)*VLOOKUP($A6,'Regulation 28 calculator (rand)'!$C10:$E$20,3,FALSE)),\"\",VLOOKUP($A6,'Fund list'!A:J,MATCH('Allocation (rand)'!C$1,'Fund list'!A$5:J$5,0),FALSE)*VLOOKUP($A6,'Regulation 28 calculator (rand)'!$C10:$E$20,3,FALSE))","v":""},{"$f":"IF(ISERROR(VLOOKUP($A6,'Fund list'!A:J,MATCH('Allocation (rand)'!D$1,'Fund list'!A$5:J$5,0),FALSE)*VLOOKUP($A6,'Regulation 28 calculator (rand)'!$C10:$E$20,3,FALSE)),\"\",VLOOKUP($A6,'Fund list'!A:J,MATCH('Allocation (rand)'!D$1,'Fund list'!A$5:J$5,0),FALSE)*VLOOKUP($A6,'Regulation 28 calculator (rand)'!$C10:$E$20,3,FALSE))","v":""}]
[{"$f":"IF('Regulation 28 calculator (rand)'!C11>\"\",'Regulation 28 calculator (rand)'!C11,\"\")","v":""},{"$f":"IF(ISERROR(VLOOKUP($A7,'Fund list'!A:J,MATCH('Allocation (rand)'!B$1,'Fund list'!A$5:J$5,0),FALSE)*VLOOKUP($A7,'Regulation 28 calculator (rand)'!$C11:$E$20,3,FALSE)),\"\",VLOOKUP($A7,'Fund list'!A:J,MATCH('Allocation (rand)'!B$1,'Fund list'!A$5:J$5,0),FALSE)*VLOOKUP($A7,'Regulation 28 calculator (rand)'!$C11:$E$20,3,FALSE))","v":""},{"$f":"IF(ISERROR(VLOOKUP($A7,'Fund list'!A:J,MATCH('Allocation (rand)'!C$1,'Fund list'!A$5:J$5,0),FALSE)*VLOOKUP($A7,'Regulation 28 calculator (rand)'!$C11:$E$20,3,FALSE)),\"\",VLOOKUP($A7,'Fund list'!A:J,MATCH('Allocation (rand)'!C$1,'Fund list'!A$5:J$5,0),FALSE)*VLOOKUP($A7,'Regulation 28 calculator (rand)'!$C11:$E$20,3,FALSE))","v":""},{"$f":"IF(ISERROR(VLOOKUP($A7,'Fund list'!A:J,MATCH('Allocation (rand)'!D$1,'Fund list'!A$5:J$5,0),FALSE)*VLOOKUP($A7,'Regulation 28 calculator (rand)'!$C11:$E$20,3,FALSE)),\"\",VLOOKUP($A7,'Fund list'!A:J,MATCH('Allocation (rand)'!D$1,'Fund list'!A$5:J$5,0),FALSE)*VLOOKUP($A7,'Regulation 28 calculator (rand)'!$C11:$E$20,3,FALSE))","v":""}]
[{"$f":"IF('Regulation 28 calculator (rand)'!C12>\"\",'Regulation 28 calculator (rand)'!C12,\"\")","v":""},{"$f":"IF(ISERROR(VLOOKUP($A8,'Fund list'!A:J,MATCH('Allocation (rand)'!B$1,'Fund list'!A$5:J$5,0),FALSE)*VLOOKUP($A8,'Regulation 28 calculator (rand)'!$C12:$E$20,3,FALSE)),\"\",VLOOKUP($A8,'Fund list'!A:J,MATCH('Allocation (rand)'!B$1,'Fund list'!A$5:J$5,0),FALSE)*VLOOKUP($A8,'Regulation 28 calculator (rand)'!$C12:$E$20,3,FALSE))","v":""},{"$f":"IF(ISERROR(VLOOKUP($A8,'Fund list'!A:J,MATCH('Allocation (rand)'!C$1,'Fund list'!A$5:J$5,0),FALSE)*VLOOKUP($A8,'Regulation 28 calculator (rand)'!$C12:$E$20,3,FALSE)),\"\",VLOOKUP($A8,'Fund list'!A:J,MATCH('Allocation (rand)'!C$1,'Fund list'!A$5:J$5,0),FALSE)*VLOOKUP($A8,'Regulation 28 calculator (rand)'!$C12:$E$20,3,FALSE))","v":""},{"$f":"IF(ISERROR(VLOOKUP($A8,'Fund list'!A:J,MATCH('Allocation (rand)'!D$1,'Fund list'!A$5:J$5,0),FALSE)*VLOOKUP($A8,'Regulation 28 calculator (rand)'!$C12:$E$20,3,FALSE)),\"\",VLOOKUP($A8,'Fund list'!A:J,MATCH('Allocation (rand)'!D$1,'Fund list'!A$5:J$5,0),FALSE)*VLOOKUP($A8,'Regulation 28 calculator (rand)'!$C12:$E$20,3,FALSE))","v":""}]
{"$rows_left_out":10}
{"sheet":"Unit trust asset class limits","index":6,"n_rows":25,"n_cols":7,"rows_kept":25,"cut":false,"hidden":false,"merged":[[2,4,2,6],[24,2,24,5],[19,2,21,6]]}
[]
[null,null,"Regulation 28 asset class limits",{"$f":"IF(CONCATENATE('Regulation 28 calculator (%)'!C7,'Regulation 28 calculator (%)'!C8,'Regulation 28 calculator (%)'!C9,'Regulation 28 calculator (%)'!C10,'Regulation 28 calculator (%)'!C11,'Regulation 28 calculator (%)'!C12,'Regulation 28 calculator (%)'!C13,'Regulation 28 calculator (%)'!C14,'Regulation 28 calculator (%)'!C15,'Regulation 28 calculator (%)'!C16,'Regulation 28 calculator (%)'!C17,'Regulation 28 calculator (%)'!C18,'Regulation 28 calculator (%)'!C19,'Regulation 28 calculator (%)'!C20)>\"\",\"percent\",IF(CONCATENATE('Regulation 28 calculator (rand)'!C7,'Regulation 28 calculator (rand)'!C8,'Regulation 28 calculator (rand)'!C9,'Regulation 28 calculator (rand)'!C10,'Regulation 28 calculator (rand)'!C11,'Regulation 28 calculator (rand)'!C12,'Regulation 28 calculator (rand)'!C13,'Regulation 28 calculator (rand)'!C14,'Regulation 28 calculator (rand)'!C15,'Regulation 28 calculator (rand)'!C16,'Regulation 28 calculator (rand)'!C17,'Regulation 28 calculator (rand)'!C18,'Regulation 28 calculator (rand)'!C19,'Regulation 28 calculator (rand)'!C20)>\"\",\"rand\",\"none\"))","v":"none"}]
[]
[null,null,"Unit trust name","Regulation 28 compliant","Equity","Property","Foreign"]
[null,null,{"$f":"IF($D$2=\"percent\",\n  IF(ISERROR(VLOOKUP('Regulation 28 calculator (%)'!C7,'Fund list'!A:A,1,FALSE)),\"\",VLOOKUP('Regulation 28 calculator (%)'!C7,'Fund list'!A:A,1,FALSE)),\n  IF($D$2=\"rand\",\n   IF(ISERROR(VLOOKUP('Regulation 28 calculator (rand)'!C7,'Fund list'!A:A,1,FALSE)),\"\",VLOOKUP('Regulation 28 calculator (rand)'!C7,'Fund list'!A:A,1,FALSE)),\n   \"\"))","v":""},{"$f":"IF(C5<>\"\",IF(VLOOKUP($C5,'Fund list'!$A:$I,MATCH(D$4,'Fund list'!$A$5:$I$5,0),FALSE)=\"Yes\",\"Yes\",\"No\"),\"\")","v":""},{"$f":"IF(C5<>\"\",VLOOKUP($C5,'Fund list'!$A:$I,MATCH(E$4,'Fund list'!$A$5:$I$5,0),FALSE),\"\")","v":""},{"$f":"IF(D5<>\"\",VLOOKUP($C5,'Fund list'!$A:$I,MATCH(F$4,'Fund list'!$A$5:$I$5,0),FALSE),\"\")","v":""},{"$f":"IF(E5<>\"\",VLOOKUP($C5,'Fund list'!$A:$I,MATCH(G$4,'Fund list'!$A$5:$I$5,0),FALSE),\"\")","v":""}]
[null,null,{"$f":"IF($D$2=\"percent\",\n  IF(ISERROR(VLOOKUP('Regulation 28 calculator (%)'!C8,'Fund list'!A:A,1,FALSE)),\"\",VLOOKUP('Regulation 28 calculator (%)'!C8,'Fund list'!A:A,1,FALSE)),\n  IF($D$2=\"rand\",\n   IF(ISERROR(VLOOKUP('Regulation 28 calculator (rand)'!C8,'Fund list'!A:A,1,FALSE)),\"\",VLOOKUP('Regulation 28 calculator (rand)'!C8,'Fund list'!A:A,1,FALSE)),\n   \"\"))","v":""},{"$f":"IF(C6<>\"\",IF(VLOOKUP($C6,'Fund list'!$A:$I,MATCH(D$4,'Fund list'!$A$5:$I$5,0),FALSE)=\"Yes\",\"Yes\",\"No\"),\"\")","v":""},{"$f":"IF(C6<>\"\",VLOOKUP($C6,'Fund list'!$A:$I,MATCH(E$4,'Fund list'!$A$5:$I$5,0),FALSE),\"\")","v":""},{"$f":"IF(D6<>\"\",VLOOKUP($C6,'Fund list'!$A:$I,MATCH(F$4,'Fund list'!$A$5:$I$5,0),FALSE),\"\")","v":""},{"$f":"IF(E6<>\"\",VLOOKUP($C6,'Fund list'!$A:$I,MATCH(G$4,'Fund list'!$A$5:$I$5,0),FALSE),\"\")","v":""}]
[null,null,{"$f":"IF($D$2=\"percent\",\n  IF(ISERROR(VLOOKUP('Regulation 28 calculator (%)'!C9,'Fund list'!A:A,1,FALSE)),\"\",VLOOKUP('Regulation 28 calculator (%)'!C9,'Fund list'!A:A,1,FALSE)),\n  IF($D$2=\"rand\",\n   IF(ISERROR(VLOOKUP('Regulation 28 calculator (rand)'!C9,'Fund list'!A:A,1,FALSE)),\"\",VLOOKUP('Regulation 28 calculator (rand)'!C9,'Fund list'!A:A,1,FALSE)),\n   \"\"))","v":""},{"$f":"IF(C7<>\"\",IF(VLOOKUP($C7,'Fund list'!$A:$I,MATCH(D$4,'Fund list'!$A$5:$I$5,0),FALSE)=\"Yes\",\"Yes\",\"No\"),\"\")","v":""},{"$f":"IF(C7<>\"\",VLOOKUP($C7,'Fund list'!$A:$I,MATCH(E$4,'Fund list'!$A$5:$I$5,0),FALSE),\"\")","v":""},{"$f":"IF(D7<>\"\",VLOOKUP($C7,'Fund list'!$A:$I,MATCH(F$4,'Fund list'!$A$5:$I$5,0),FALSE),\"\")","v":""},{"$f":"IF(E7<>\"\",VLOOKUP($C7,'Fund list'!$A:$I,MATCH(G$4,'Fund list'!$A$5:$I$5,0),FALSE),\"\")","v":""}]
[null,null,{"$f":"IF($D$2=\"percent\",\n  IF(ISERROR(VLOOKUP('Regulation 28 calculator (%)'!C10,'Fund list'!A:A,1,FALSE)),\"\",VLOOKUP('Regulation 28 calculator (%)'!C10,'Fund list'!A:A,1,FALSE)),\n  IF($D$2=\"rand\",\n   IF(ISERROR(VLOOKUP('Regulation 28 calculator (rand)'!C10,'Fund list'!A:A,1,FALSE)),\"\",VLOOKUP('Regulation 28 calculator (rand)'!C10,'Fund list'!A:A,1,FALSE)),\n   \"\"))","v":""},{"$f":"IF(C8<>\"\",IF(VLOOKUP($C8,'Fund list'!$A:$I,MATCH(D$4,'Fund list'!$A$5:$I$5,0),FALSE)=\"Yes\",\"Yes\",\"No\"),\"\")","v":""},{"$f":"IF(C8<>\"\",VLOOKUP($C8,'Fund list'!$A:$I,MATCH(E$4,'Fund list'!$A$5:$I$5,0),FALSE),\"\")","v":""},{"$f":"IF(D8<>\"\",VLOOKUP($C8,'Fund list'!$A:$I,MATCH(F$4,'Fund list'!$A$5:$I$5,0),FALSE),\"\")","v":""},{"$f":"IF(E8<>\"\",VLOOKUP($C8,'Fund list'!$A:$I,MATCH(G$4,'Fund list'!$A$5:$I$5,0),FALSE),\"\")","v":""}]
{"$rows_left_out":18}
{"sheet":"Fund list","index":7,"n_rows":71,"n_cols":6,"rows_kept":71,"cut":false,"hidden":false,"merged":[[4,6,4,8]]}
[]
[]
[]
["Public Funds - Intended Maximum Limits"]
["Fund name","Fund code","Regulation 28 compliant","Equity","Property","Foreign"]
["Allan Gray Equity Fund","AGEF","No",0.94,0.02,0.12]
["Allan Gray Balanced Fund","AGBF","Yes",0.61,0.02,0.24]
["Allan Gray Stable Fund","AGSF","Yes",0.28000000000000003,0.03,0.24]
{"$rows_left_out":63}